BDBM96893 (3R,4aR,5R,7R)-7-tert-butyl-2-keto-3-[2-keto-2-[2-(2-methoxyphenyl)ethylamino]ethyl]-5-methyl-1-octyl-3,4,5,7-tetrahydropyrano[4,3-b]pyridine-4a-carboxylic acid methyl ester::(3R,4aR,5R,7R)-7-tert-butyl-3-[2-[2-(2-methoxyphenyl)ethylamino]-2-oxoethyl]-5-methyl-1-octyl-2-oxo-3,4,5,7-tetrahydropyrano[4,3-b]pyridine-4a-carboxylic acid methyl ester::MLS003812928::SMR002481883::cid_56589305::methyl (3R,4aR,5R,7R)-7-tert-butyl-3-[2-[2-(2-methoxyphenyl)ethylamino]-2-oxidanylidene-ethyl]-5-methyl-1-octyl-2-oxidanylidene-3,4,5,7-tetrahydropyrano[4,3-b]pyridine-4a-carboxylate::methyl (3R,4aR,5R,7R)-7-tert-butyl-3-[2-[2-(2-methoxyphenyl)ethylamino]-2-oxoethyl]-5-methyl-1-octyl-2-oxo-3,4,5,7-tetrahydropyrano[4,3-b]pyridine-4a-carboxylate
SMILES CCCCCCCCN1C(=O)[C@@H](CC(=O)NCCc2ccccc2OC)C[C@@]2([C@@H](C)O[C@H](C=C12)C(C)(C)C)C(=O)OC
InChI Key InChIKey=DCQOKFYUWPAURR-RNIUERASSA-N
Data  2 IC50  2 EC50
  Tab Delimited (TSV)   2D SDfile   Computed 3D by Vconf -m prep SDfile
Find this compound or compounds like it in BindingDB:
Activity Spreadsheet -- Enzyme Inhibition Constant Data from BindingDB
Found 4 hits for monomerid = 96893
TargetGuanine nucleotide-binding protein subunit alpha-15(Homo sapiens (Human))
The Scripps Research Institute Molecular Screening Center
Curated by PubChem BioAssay
LigandPNGBDBM96893((3R,4aR,5R,7R)-7-tert-butyl-2-keto-3-[2-keto-2-[2-...)
Affinity DataEC50: >2.99E+4nM
In DepthDetails PCBioAssay
TargetGuanine nucleotide-binding protein subunit alpha-15(Homo sapiens (Human))
The Scripps Research Institute Molecular Screening Center
Curated by PubChem BioAssay
LigandPNGBDBM96893((3R,4aR,5R,7R)-7-tert-butyl-2-keto-3-[2-keto-2-[2-...)
Affinity DataIC50: >2.99E+4nM
In DepthDetails PCBioAssay
TargetTrace amine-associated receptor 1(Homo sapiens (Human))
The Scripps Research Institute Molecular Screening Center
Curated by PubChem BioAssay
LigandPNGBDBM96893((3R,4aR,5R,7R)-7-tert-butyl-2-keto-3-[2-keto-2-[2-...)
Affinity DataEC50:  5.23E+3nM
In DepthDetails PCBioAssay
TargetTrace amine-associated receptor 1(Homo sapiens (Human))
The Scripps Research Institute Molecular Screening Center
Curated by PubChem BioAssay
LigandPNGBDBM96893((3R,4aR,5R,7R)-7-tert-butyl-2-keto-3-[2-keto-2-[2-...)
Affinity DataIC50:  6.93E+3nM
In DepthDetails PCBioAssay