BDBM97465 US8470800, B::US8609833, 85
SMILES O[C@H]1[C@@H](O)[C@@H](O[C@@H]1CO[N+]([O-])=O)n1cnc2c(NC3CCCC3)nc(Cl)nc12
InChI Key InChIKey=FFWYJZUZECPVFM-IDTAVKCVSA-N
Data  4 KI
  Tab Delimited (TSV)   2D SDfile   Computed 3D by Vconf -m prep SDfile
Find this compound or compounds like it in BindingDB:
Activity Spreadsheet -- Enzyme Inhibition Constant Data from BindingDB
Found 4 hits for monomerid = 97465
TargetAdenosine receptor A1(Homo sapiens (Human))
Inotek Pharmaceuticals
US Patent
LigandPNGBDBM97465(US8470800, B | US8609833, 85)
Affinity DataKi:  2.63nM ΔG°:  -10.9kcal/molepH: 7.4 T: 2°C. Assay description: Radioligand binding assay using adenosine receptor.
In DepthDetails US Patent
TargetAdenosine receptor A1(Homo sapiens (Human))
Inotek Pharmaceuticals
US Patent
LigandPNGBDBM97465(US8470800, B | US8609833, 85)
Affinity DataKi:  2.63nM. Assay description: The affinities of selected Purine Derivatives for the adenosine A1 receptor were determined by measuring the displacement of specific [3H] 2-chloro-N...
In DepthDetails US Patent
TargetAdenosine receptor A3(Homo sapiens (Human))
Inotek Pharmaceuticals
US Patent
LigandPNGBDBM97465(US8470800, B | US8609833, 85)
Affinity DataKi:  513nM. Assay description: The affinities of selected Purine Derivatives for the adenosine A1 receptor were determined by measuring the displacement of specific [3H] 2-chloro-N...
In DepthDetails US Patent
TargetAdenosine receptor A2(Homo sapiens (Human))
Inotek Pharmaceuticals
US Patent
LigandPNGBDBM97465(US8470800, B | US8609833, 85)
Affinity DataKi:  4.19E+3nM. Assay description: The affinities of selected Purine Derivatives for the adenosine A1 receptor were determined by measuring the displacement of specific [3H] 2-chloro-N...
In DepthDetails US Patent