BDBM9766 (2S)-2-[(4-methylbenzene)(2-methylpropyl)sulfonamido]-6-(3-phenylpropanamido)hexanoic acid::Lysine Sulfonamide 11c
SMILES CC(C)CN([C@@H](CCCCNC(=O)CCc1ccccc1)C(O)=O)S(=O)(=O)c1ccc(C)cc1
InChI Key InChIKey=WTDVMSFXXBREEA-DEOSSOPVSA-N
Data  1 KI
  Tab Delimited (TSV)   2D SDfile   Computed 3D by Vconf -m prep SDfile
Find this compound or compounds like it in BindingDB:
Activity Spreadsheet -- Enzyme Inhibition Constant Data from BindingDB
Found 1 hit for monomerid = 9766
TargetDimer of Gag-Pol polyprotein [501-599](Human immunodeficiency virus type 1)
Pharmacor
LigandPNGBDBM9766((2S)-2-[(4-methylbenzene)(2-methylpropyl)sulfonami...)
Affinity DataKi:  6.90nM ΔG°:  -11.3kcal/molepH: 4.7 T: 2°C. Assay description: HIV-1 protease activity was measured by a continuous fluorometric assay using the internally quenched fluorogenic substrate DABCYL-Ser-Gln-Asn-Tyr-Pr...
In DepthDetails ArticlePubMed