BDBM97664 US8476295, 1.1.02
SMILES Cc1ccc(CN2C3CCC2CC(C3)Nc2ccc3[nH]ncc3c2)cc1
InChI Key InChIKey=CUJPUWSIKWTBRS-UHFFFAOYSA-N
Data  2 KI
  Tab Delimited (TSV)   2D SDfile   Computed 3D by Vconf -m prep SDfile
Find this compound or compounds like it in BindingDB:
Activity Spreadsheet -- Enzyme Inhibition Constant Data from BindingDB
Found 2 hits for monomerid = 97664
TargetRho-associated protein kinase 2 [11-552](Homo sapiens (Human))
Inspire
US Patent
LigandPNGBDBM97664(US8476295, 1.1.02)
Affinity DataKi:  20nMpH: 7.2Assay Description:Inhibition of Rho kinase 2 and Rho kinase I activity was determined using the IMAP Screening Express Kit (Molecular Devices product number #8073).
In DepthDetails US Patent
TargetRho-associated protein kinase 1 [17-535](Homo Sapiens (Human))
Inspire
US Patent
LigandPNGBDBM97664(US8476295, 1.1.02)
Affinity DataKi:  91nMpH: 7.2Assay Description:Inhibition of Rho kinase 2 and Rho kinase I activity was determined using the IMAP Screening Express Kit (Molecular Devices product number #8073).
In DepthDetails US Patent