BDBM97726 US8481564, 4
SMILES O=C(Nc1ccc(cc1C1=CCCCC1)C1CNC(=O)NC1)c1nc(c[nH]1)C#N
InChI Key InChIKey=ZQYZMMAMCNNEQG-UHFFFAOYSA-N
Data  1 IC50
  Tab Delimited (TSV)   2D SDfile   Computed 3D by Vconf -m prep SDfile
Find this compound or compounds like it in BindingDB:
Activity Spreadsheet -- Enzyme Inhibition Constant Data from BindingDB
Found 1 hit for monomerid = 97726
TargetMacrophage colony-stimulating factor 1(Mus musculus (Mouse))
Janssen Pharmaceutica
US Patent
LigandPNGBDBM97726(US8481564, 4)
Affinity DataIC50:  3nMpH: 7.5Assay Description:A fluorescence polarization competition immunoassay was used to measure compound inhibition of CSF-1R phosphorylation of tyrosine on a synthetic CSF-...
In DepthDetails US Patent