BDBM97777 US8476225, 38
SMILES CC(C)(C)[C@H](NC(=O)OC1CCCC1)C(=O)N1CN(C[C@H]1C(=O)N[C@@]1(C[C@H]1C=C)C(=O)NS(=O)(=O)C1CC1)c1ccc(cc1)C1CCCCC1
InChI Key InChIKey=DDFLEYUOIUJHGL-MQHVEIOXSA-N
Data  1 IC50
  Tab Delimited (TSV)   2D SDfile   Computed 3D by Vconf -m prep SDfile
Find this compound or compounds like it in BindingDB:
Activity Spreadsheet -- Enzyme Inhibition Constant Data from BindingDB
Found 1 hit for monomerid = 97777
TargetGenome polyprotein [1027-1657](Hepatitis C virus genotype 1a (isolate 1) (HCV))
Gilead Sciences
US Patent
LigandPNGBDBM97777(US8476225, 38)
Affinity DataIC50:  5nMpH: 7.5 T: 2°C. Assay description: Inhibition assay using HCV protease.
In DepthDetails US Patent