BDBM97839 US8481536, 381::US8481536, 582
SMILES CN1CCN(CCCOc2ccc(Nc3nnc4cc(cc(C)c4n3)-c3c(C)cccc3C)cc2)CC1
InChI Key InChIKey=BJSOLGJICLKREX-UHFFFAOYSA-N
Data  2 IC50
  Tab Delimited (TSV)   2D SDfile   Computed 3D by Vconf -m prep SDfile
Find this compound or compounds like it in BindingDB:
Activity Spreadsheet -- Enzyme Inhibition Constant Data from BindingDB
Found 2 hits for monomerid = 97839
TargetPlatelet-derived growth factor receptor beta(Homo sapiens (Human))
Targegen
US Patent
LigandPNGBDBM97839(US8481536, 381 | US8481536, 582)
Affinity DataIC50:  50.3nM. Assay description: Testing of inhibition of kinases in vitro using luciferase-based assay from KinaseGlo, Promega Corp.
In DepthDetails US Patent
TargetProto-oncogene tyrosine-protein kinase Src(Homo sapiens (Human))
Targegen
US Patent
LigandPNGBDBM97839(US8481536, 381 | US8481536, 582)
Affinity DataIC50:  35.8nMT: 2°C. Assay description: Testing of inhibition of kinases in vitro using luciferase-based assay from KinaseGlo, Promega Corp.
In DepthDetails US Patent