BDBM98170 US8492379, 26
SMILES CCN(CC)C(=O)Cc1c(nc2c(C)cc(C)nn12)-c1ccc(OC)cc1
InChI Key InChIKey=RGPSCAJBNWAKNP-UHFFFAOYSA-N
Data  1 KI
  Tab Delimited (TSV)   2D SDfile   Computed 3D by Vconf -m prep SDfile
Find this compound or compounds like it in BindingDB:
Activity Spreadsheet -- Enzyme Inhibition Constant Data from BindingDB
Found 1 hit for monomerid = 98170
TargetTranslocator protein(Homo sapiens (Human))
The University Of Sydney
US Patent
LigandPNGBDBM98170(US8492379, 26)
Affinity DataKi:  2.61nM. Assay description: In vitro binding activity of TSPO.
In DepthDetails US Patent