BDBM98274 US8481733, 86
SMILES Nc1nccn2c(nc(-c3ccc(Oc4ccccc4)c(O)c3)c12)C1CCC1
InChI Key InChIKey=ZSUIFNPIKGXHBP-UHFFFAOYSA-N
Data  1 IC50
  Tab Delimited (TSV)   2D SDfile   Computed 3D by Vconf -m prep SDfile
Find this compound or compounds like it in BindingDB:
Activity Spreadsheet -- Enzyme Inhibition Constant Data from BindingDB
Found 1 hit for monomerid = 98274
TargetActivated CDC42 kinase 1(Homo sapiens (Human))
Osi Pharmaceuticals
US Patent
LigandPNGBDBM98274(US8481733, 86)
Affinity DataIC50:  58.9nM. Assay description: AlphaScreen (amplified luminescent proximity homogeneous assay) assay was used to test for ACK1 inhibitory activity.
In DepthDetails US Patent