BDBM98469 US8481733, 281
SMILES COc1cc(ccc1Oc1ccccc1)-c1nc(C2CCC2)n2ncnc(N)c12
InChI Key InChIKey=ZIVITYGTUDHHAJ-UHFFFAOYSA-N
Data  1 IC50
  Tab Delimited (TSV)   2D SDfile   Computed 3D by Vconf -m prep SDfile
Find this compound or compounds like it in BindingDB:
Activity Spreadsheet -- Enzyme Inhibition Constant Data from BindingDB
Found 1 hit for monomerid = 98469
TargetActivated CDC42 kinase 1(Homo sapiens (Human))
Osi Pharmaceuticals
US Patent
LigandPNGBDBM98469(US8481733, 281)
Affinity DataIC50:  1.17E+3nM. Assay description: AlphaScreen (amplified luminescent proximity homogeneous assay) assay was used to test for ACK1 inhibitory activity.
In DepthDetails US Patent