BDBM98593 US8476306, 6.19::methyl 4-[[(1R)-2-[[(1S)-2-[(4-carbamimidoylphenyl)methylamino]-1-(hydroxymethyl)-2-oxo-ethyl]amino]-1-(hydroxymethyl)-2-oxo-ethyl]sulfamoylmethyl]benzoate
SMILES COC(=O)c1ccc(CS(=O)(=O)N[C@H](CO)C(=O)N[C@@H](CO)C(=O)NCc2ccc(cc2)C(N)=N)cc1
InChI Key InChIKey=ZMSQIVBNHIMPNU-RBUKOAKNSA-N
Data  4 KI
  Tab Delimited (TSV)   2D SDfile   Computed 3D by Vconf -m prep SDfile
Find this compound or compounds like it in BindingDB:
Activity Spreadsheet -- Enzyme Inhibition Constant Data from BindingDB
Found 4 hits for monomerid = 98593
TargetSerine protease 1(Rattus norvegicus)
The Medicines
US Patent
LigandPNGBDBM98593(US8476306, 6.19 | methyl 4-[[(1R)-2-[[(1S)-2-[(4-c...)
Affinity DataKi:  20nM ΔG°:  -10.5kcal/moleT: 2°C. Assay description: Inhibition constant of the compound against Trypsin
In DepthDetails US Patent
TargetUrokinase plasminogen activator surface receptor(Rattus norvegicus)
The Medicines
US Patent
LigandPNGBDBM98593(US8476306, 6.19 | methyl 4-[[(1R)-2-[[(1S)-2-[(4-c...)
Affinity DataKi:  230nM ΔG°:  -9.02kcal/moleT: 2°C. Assay description: Inhibition constant of the compound against Plasminogen activator urokinase
In DepthDetails US Patent
TargetPlasminogen(Rattus norvegicus)
The Medicines
US Patent
LigandPNGBDBM98593(US8476306, 6.19 | methyl 4-[[(1R)-2-[[(1S)-2-[(4-c...)
Affinity DataKi:  960nM ΔG°:  -8.18kcal/moleT: 2°C. Assay description: Inhibition constant of the compound against Plasmin
In DepthDetails US Patent
TargetProthrombin(Rattus norvegicus)
The Medicines
US Patent
LigandPNGBDBM98593(US8476306, 6.19 | methyl 4-[[(1R)-2-[[(1S)-2-[(4-c...)
Affinity DataKi:  4.20E+3nM ΔG°:  -7.31kcal/moleT: 2°C. Assay description: Inhibition constant of the compound against Thrombin
In DepthDetails US Patent