BDBM98666 US8497270, 25
SMILES CCOC(=O)c1cc(F)ccc1C#N
InChI Key InChIKey=QMZSRWKQXUGYBE-UHFFFAOYSA-N
Data  1 IC50
  Tab Delimited (TSV)   2D SDfile   Computed 3D by Vconf -m prep SDfile
Find this compound or compounds like it in BindingDB:
Activity Spreadsheet -- Enzyme Inhibition Constant Data from BindingDB
Found 1 hit for monomerid = 98666
TargetGag-Pol polyprotein(Human immunodeficiency virus type 1 (HIV-1))
Elanco Animal Health Ireland
US Patent
LigandPNGBDBM98666(US8497270, 25)
Affinity DataIC50:  6.80E+4nM. Assay description: Inhibition of HIV integrase.
In DepthDetails US Patent