BDBM99290 US8497281, 135::US8497281, 68::US9120769, 68::US9663470, 68
SMILES Oc1ccc(cc1)C(=O)N1CCCC2[C@@H]1CCc1ccccc21
InChI Key InChIKey=GEBBHLKNKYHIJP-GGYWPGCISA-N
Data  4 IC50
  Tab Delimited (TSV)   2D SDfile   Computed 3D by Vconf -m prep SDfile
Find this compound or compounds like it in BindingDB:
Activity Spreadsheet -- Enzyme Inhibition Constant Data from BindingDB
Found 4 hits for monomerid = 99290
Target11-beta-hydroxysteroid dehydrogenase 1(Homo sapiens (Human))
Vitae Pharmaceuticals
US Patent
LigandPNGBDBM99290(US8497281, 135 | US8497281, 68 | US9120769, 68 | U...)
Affinity DataIC50:  106nMpH: 6.0 T: 2°C. Assay description: In vitro inhibition of 11beta-HSD1 by test compounds is determined with HTRF (Homogeneous Time-Resolved Fluoresence) technology (cisbio international...
In DepthDetails US Patent
Target11-beta-hydroxysteroid dehydrogenase 1(Homo sapiens (Human))
Vitae Pharmaceuticals
US Patent
LigandPNGBDBM99290(US8497281, 135 | US8497281, 68 | US9120769, 68 | U...)
Affinity DataIC50:  435nM. Assay description: In vitro inhibition of 11β-HSD1 by test compounds is determined with HTRF (Homogeneous Time-Resolved Fluorescence) technology (cisbio internatio...
In DepthDetails US Patent
Target11-beta-hydroxysteroid dehydrogenase 1(Homo sapiens (Human))
Vitae Pharmaceuticals
US Patent
LigandPNGBDBM99290(US8497281, 135 | US8497281, 68 | US9120769, 68 | U...)
Affinity DataIC50:  435nMpH: 6.0Assay Description:n vitro inhibition of 11β-HSD1 by test compounds is determined with HTRF (Homogeneous Time-Resolved Fluorescence) technology (cisbio internation...
In DepthDetails US Patent
Target11-beta-hydroxysteroid dehydrogenase 1(Homo sapiens (Human))
Vitae Pharmaceuticals
US Patent
LigandPNGBDBM99290(US8497281, 135 | US8497281, 68 | US9120769, 68 | U...)
Affinity DataIC50:  435nMpH: 6.0 T: 2°C. Assay description: In vitro inhibition of 11beta-HSD1 by test compounds is determined with HTRF (Homogeneous Time-Resolved Fluoresence) technology (cisbio international...
In DepthDetails US Patent