BDBM9957 (8S)-2,15-dimethyl-8-propyltetracyclo[8.7.0.0^{2,7}.0^{11,15}]heptadec-6-en-14-one::6-Substituted Androst-4-ene Analog 18c
SMILES CCC[C@H]1CC2C3CCC(=O)C3(C)CCC2C2(C)CCCC=C12
InChI Key InChIKey=FACSJNDEAKXXDF-LHCCWGHRSA-N
Data  1 KI  1 IC50
  Tab Delimited (TSV)   2D SDfile   Computed 3D by Vconf -m prep SDfile
Find this compound or compounds like it in BindingDB:
Activity Spreadsheet -- Enzyme Inhibition Constant Data from BindingDB
Found 1 hit for monomerid = 9957
TargetAromatase(Homo sapiens (Human))
Tohoku College Of Pharmacy
LigandPNGBDBM9957((8S)-2,15-dimethyl-8-propyltetracyclo[8.7.0.0^{2,7...)
Affinity DataKi:  30nM ΔG°:  -10.7kcal/mole IC50:  230nMpH: 7.5 T: 2°C. Assay description: The enzyme activity was assayed by measuring the 3H-labeled H2O formed from [1beta-3H] Androstenedione during aromatization. After incubation, the re...
In DepthDetails ArticlePubMed