Target
S-adenosylmethionine synthase isoform type-2
Ligand
BDBM508348
Substrate
Meas. Tech.
Phosphate Sensor Fluorescence Assay
IC50
<200±n/a nM
Citation
 Alam, MCleary, LFleury, MPei, ZSteel, RSutton, JKnox, JENewby, ZE 2-oxoquinazoline derivatives as methionine adenosyltransferase 2A inhibitors US Patent  US11046691 Publication Date 6/29/2021 
Target
Name:
S-adenosylmethionine synthase isoform type-2
Synonyms:
AMS2 MAT 2 MAT2A METK2_HUMAN Methionine adenosyltransferase II
Type:
Protein
Mol. Mass.:
43659.65
Organism:
Human
Description:
P31153
Residue:
395
  
Inhibitor
Name:
BDBM508348
Synonyms:
1-(3-chloropyridin-2-yl)-7-ethyl-4- (methylamino)quinazolin-2(1H)-one US11084798, Cpd No 659 | US11130759, Cpd. No. 659
Type:
Small organic molecule
Emp. Form.:
C16H15ClN4O
Mol. Mass.:
314.77
SMILES:
CCc1ccc2c(NC)nc(=O)n(-c3ncccc3Cl)c2c1
: