Target
Plasmepsin I
Ligand
BDBM8010
Substrate
Peptide Substrate
Meas. Tech.
Enzyme Inhibition Measurements
Ki
4.4±n/a nM
Citation
 Ersmark, KFeierberg, IBjelic, SHamelink, EHackett, FBlackman, MJHulten, JSamuelsson, BAqvist, JHallberg, A Potent inhibitors of the Plasmodium falciparum enzymes plasmepsin I and II devoid of cathepsin D inhibitory activity. J Med Chem 47:110-22 (2004)  
Target
Name:
Plasmepsin I
Synonyms:
PFAPG PMI Plasmepsin-1 precursor
Type:
Enzyme
Mol. Mass.:
51463.30
Organism:
Plasmodium falciparum
Description:
Residue:
452
  
Inhibitor
Name:
BDBM8010
Synonyms:
(2R,3R,4R,5R)-3,4-dihydroxy-N,N'-bis[(1S,2R)-2-hydroxy-2,3-dihydro-1H-inden-1-yl]-2,5-bis({[(2E,4E)-5-phenylpenta-2,4-dien-1-yl]oxy})hexanediamide C2-symmetric compound 18
Type:
Small organic molecule
Emp. Form.:
C46H48N2O8
Mol. Mass.:
756.8819
SMILES:
O[C@H]([C@@H](O)[C@@H](OC\C=C\C=C\c1ccccc1)C(=O)N[C@@H]1[C@H](O)Cc2ccccc12)[C@@H](OC\C=C\C=C\c1ccccc1)C(=O)N[C@@H]1[C@H](O)Cc2ccccc12
:
Substrate
Name:
Peptide Substrate
Synonyms:
Type:
Peptide
Mol. Mass.:
3501.67
Organism:
Description:
Residue:
31