Target
Tyrosine-protein kinase JAK2
Ligand
BDBM174031
Substrate
Meas. Tech.
JAK2 Kinase Assay
IC50
1.00±n/a nM
Citation
 Brasca, MGBindi, SCaldarelli, MNesi, MOrrenius, SCPanzeri, A Substituted pyrroles active as kinases inhibitors US Patent  US9688661 Publication Date 6/27/2017 
Target
Name:
Tyrosine-protein kinase JAK2
Synonyms:
JAK-2 JAK2_HUMAN Janus kinase 2 (JAK2) | Janus kinase 2 (a protein tyrosine kinase)
Type:
Protein
Mol. Mass.:
130684.68
Organism:
Homo sapiens (Human)
Description:
O60674
Residue:
1132
  
Inhibitor
Name:
BDBM174031
Synonyms:
US9688661, 2-(5-Chloro-2-ethylphenyl)-N-methyl-5-[6-(methylamino)pyrimidin-4-yl]-1H-pyrrole-3-carboxamide (compd 302)
Type:
Small organic molecule
Emp. Form.:
C19H20ClN5O
Mol. Mass.:
369.848
SMILES:
CCc1ccc(Cl)cc1-c1c(cc(-c2cc(NC)ncn2)n1C)C(N)=O
: