Target
Non-receptor tyrosine-protein kinase TYK2 [833-1187]
Ligand
BDBM173996
Substrate
Meas. Tech.
TYK2 Kinase Assay
IC50
3.00±n/a nM
Citation
 Brasca, MGBindi, SCaldarelli, MNesi, MOrrenius, SCPanzeri, A Substituted pyrroles active as kinases inhibitors US Patent  US9688661 Publication Date 6/27/2017 
Target
Name:
Non-receptor tyrosine-protein kinase TYK2 [833-1187]
Synonyms:
Non-receptor tyrosine-protein kinase TYK2 (TYK2) TYK2_HUMAN
Type:
Protein
Mol. Mass.:
40613.06
Organism:
Homo sapiens (Human)
Description:
Human TYK2 variant (833-1187 aa)
Residue:
355
  
Inhibitor
Name:
BDBM173996
Synonyms:
US9688661, 2-(5-Chloro-2-ethylphenyl)-5-(7H-pyrrolo[2,3-d]pyrimidin-4-yl)-1H-pyrrole-3-carboxamide (compd 199)
Type:
Small organic molecule
Emp. Form.:
C19H15ClN5O
Mol. Mass.:
364.808
SMILES:
CCc1ccc(Cl)cc1-c1nc(cc1C(N)=O)-c1ncnc2[nH]ccc12
: