Target
Cyclin-dependent kinase 2/G1/S-specific cyclin-E1
Ligand
BDBM8053
Substrate
Histone H1
Meas. Tech.
CDK Kinase Inhibition Assay
Temperature
303.15±n/a K
Ki
140±n/a nM
Comments
extracted
Citation
 Wang, SMeades, CWood, GOsnowski, AAnderson, SYuill, RThomas, MMezna, MJackson, WMidgley, CGriffiths, GFleming, IGreen, SMcNae, IWu, SYMcInnes, CZheleva, DWalkinshaw, MDFischer, PM 2-Anilino-4-(thiazol-5-yl)pyrimidine CDK inhibitors: synthesis, SAR analysis, X-ray crystallography, and biological activity. J Med Chem 47:1662-75 (2004)  
Target
Name:
Cyclin-dependent kinase 2/G1/S-specific cyclin-E1
Synonyms:
CDK2/CycE CDK2/E Cyclin-Dependent Kinase 2 (CDK2) Cyclin-dependent kinase 2/cyclin E1
Type:
Protein
Mol. Mass.:
Description:
Components:
This complex has 2 components.
Component 1
Name:
Cyclin-dependent kinase 2
Synonyms:
CDK2 CDK2_HUMAN Cell division protein kinase 2 Protein cereblon/Cyclin-dependent kinase 2 | p33 protein kinase
Type:
Enzyme Subunit
Mol. Mass.:
33938.17
Organism:
Homo sapiens (Human)
Description:
P24941
Residue:
298
  
Component 2
Name:
G1/S-specific cyclin-E1
Synonyms:
CCNE CCNE1_HUMAN
Type:
Enzyme Subunit
Mol. Mass.:
47073.17
Organism:
Homo sapiens (Human)
Description:
Residue:
410
  
Inhibitor
Name:
BDBM8053
Synonyms:
2-Anilino-4-(thiazol-5-yl)pyrimidine deriv. 24 4-[4-(2,4-Dimethyl-thiazol-5-yl)-pyrimidin-2-ylamino]phenol, 5 CHEMBL442957
Type:
Small organic molecule
Emp. Form.:
C15H14N4OS
Mol. Mass.:
298.363
SMILES:
Cc1nc(C)c(s1)-c1ccnc(Nc2ccc(O)cc2)n1
:
Substrate
Name:
Histone H1
Synonyms:
Type:
Other Protein Type
Mol. Mass.:
358.43
Organism:
Bos taurus (bovine)
Description:
Residue:
3
NA