Target
Cyclin-dependent kinase 4/G1/S-specific cyclin-D1
Ligand
BDBM8077
Substrate
GST-Rb fusion protein
Meas. Tech.
CDK Inhibition Assay
Temperature
303.15±n/a K
Ki
900±n/a nM
Comments
extracted
Citation
 Wang, SWood, GMeades, CGriffiths, GMidgley, CMcNae, IMcInnes, CAnderson, SJackson, WMezna, MYuill, RWalkinshaw, MFischer, PM Synthesis and biological activity of 2-anilino-4-(1H-pyrrol-3-yl) pyrimidine CDK inhibitors. Bioorg Med Chem Lett 14:4237-40 (2004)  
Target
Name:
Cyclin-dependent kinase 4/G1/S-specific cyclin-D1
Synonyms:
CDK4/CycD CDK4/Cyclin D1 Cyclin-Dependent Kinase 4 (CDK4) Cyclin-dependent kinase 4/G1/S-specific cyclin D1 | Cyclin-dependent kinase 4/cyclin D1
Type:
Protein Complex
Mol. Mass.:
Description:
CDK4/D1 complexes were purified from insect cells co-infected with baculovirus vectors containing each of the components.
Components:
This complex has 2 components.
Component 1
Name:
Cyclin-dependent kinase 4
Synonyms:
CDK4 Cell division protein kinase 4 PSK-J3
Type:
Enzyme Subunit
Mol. Mass.:
33731.96
Organism:
Homo sapiens (Human)
Description:
P11802
Residue:
303
  
Component 2
Name:
G1/S-specific cyclin-D1
Synonyms:
B-cell lymphoma 1 protein BCL-1 oncogene CCND1 PRAD1 | PRAD1 oncogene
Type:
Enzyme Subunit
Mol. Mass.:
33717.70
Organism:
Homo sapiens (Human)
Description:
Residue:
295
  
Inhibitor
Name:
BDBM8077
Synonyms:
2-anilino-4-(1H-pyrrol-3-yl) pyrimidine deriv. 8h | 4-{2-[(4-fluorophenyl)amino]pyrimidin-4-yl}-3,5-dimethyl-1H-pyrrole-2-carbonitrile
Type:
Small organic molecule
Emp. Form.:
C17H14FN5
Mol. Mass.:
307.325
SMILES:
Cc1[nH]c(C#N)c(C)c1-c1ccnc(Nc2ccc(F)cc2)n1
:
Substrate
Name:
GST-Rb fusion protein
Synonyms:
Glutathione S-transferase (GST)-retinoblastoma (Rb) fusion RB1 Rb | retinoblastoma
Type:
Other Protein Type
Mol. Mass.:
106410.17
Organism:
Homo sapiens (Human)
Description:
GST-60 kDa Rb fusion protein (comprising amino acids 378 to 928 of retinoblastoma)
Residue:
928