Target
Plasmepsin I
Ligand
BDBM8092
Substrate
Peptide Substrate
Meas. Tech.
Enzyme Inhibition Measurements
Ki
12±n/a nM
Citation
 Noteberg, DSchaal, WHamelink, EVrang, LLarhed, M High-speed optimization of inhibitors of the malarial proteases plasmepsin I and II. J Comb Chem 5:456-64 (2003)  
Target
Name:
Plasmepsin I
Synonyms:
PFAPG PMI Plasmepsin-1 precursor
Type:
Enzyme
Mol. Mass.:
51463.30
Organism:
Plasmodium falciparum
Description:
Residue:
452
  
Inhibitor
Name:
BDBM8092
Synonyms:
(2S)-N-[(2S,3S)-4-{[(1S)-1-carbamoyl-2-(4-phenylphenyl)ethyl]amino}-3-hydroxy-1-phenylbutan-2-yl]-2-(cyclohexylformamido)-3-methylbutanamide hydroxylethylamine scaffold 6{1}
Type:
Small organic molecule
Emp. Form.:
C37H48N4O4
Mol. Mass.:
612.8014
SMILES:
CC(C)[C@H](NC(=O)C1CCCCC1)C(=O)N[C@@H](Cc1ccccc1)[C@@H](O)CN[C@@H](Cc1ccc(cc1)-c1ccccc1)C(N)=O
:
Substrate
Name:
Peptide Substrate
Synonyms:
Type:
Peptide
Mol. Mass.:
3501.67
Organism:
Description:
Residue:
31