Target
Adenosine receptor A2a
Ligand
BDBM303314
Substrate
Meas. Tech.
A2a Ki assay
Ki
0.800±n/a nM
Citation
 Ali, AKuang, RLim, YLo, MMTing, PCBiju, Pde Lera Ruiz, MDegrado, SJTung, ALHenderson, TJHong, LKim, JKim, DWLee, JWu, JWu, HXiao, YYu, TZhou, GZhu, XMcCormick, KDTagat, JRXiao, DKhan, TCao, JBerlin, MZhang, Y Aminoquinazoline compounds as A2A antagonist US Patent  US10138212 Publication Date 11/27/2018 
Target
Name:
Adenosine receptor A2a
Synonyms:
A2A adenosine receptor (hA2A) ADENOSINE A2 ADORA2 Adenosine A2A receptor (A2AAR)
Type:
G Protein-Coupled Receptor (GPCR)
Mol. Mass.:
44716.46
Organism:
Homo sapiens (Human)
Description:
P29274
Residue:
412
  
Inhibitor
Name:
BDBM303314
Synonyms:
2-amino-8-fluoro-N-[(6- methoxy-3-methyl-2- pyridyl)methyl]quinazoline- 4-carboxamide | US10138212, Example 77
Type:
Small organic molecule
Emp. Form.:
C17H16FN5O2
Mol. Mass.:
341.3396
SMILES:
COc1ccc(C)c(CNC(=O)c2nc(N)nc3c(F)cccc23)n1
: