Target
Oxysterols receptor LXR-beta
Ligand
BDBM50177011
Substrate
Meas. Tech.
Human LXRalpha and LXRbeta Coactivator Recruitment FRET Assay
EC50
4.00±n/a nM
Citation
 Claremon, DADong, CFan, YLeftheris, KLotesta, SDSingh, SBTice, CMZhao, WZheng, YZhuang, L Piperazine derivatives as liver X receptor modulators US Patent  US10144715 Publication Date 12/4/2018 
Target
Name:
Oxysterols receptor LXR-beta
Synonyms:
LXRB Liver X, LXR beta NR1H2 Nuclear receptor NER Ubiquitously-expressed nuclear receptor
Type:
Enzyme Catalytic Domain
Mol. Mass.:
50978.79
Organism:
Homo sapiens (Human)
Description:
P55055
Residue:
460
  
Inhibitor
Name:
BDBM50177011
Synonyms:
CHEMBL3815014 | US10144715, Compound 7-13
Type:
Small organic molecule
Emp. Form.:
C19H23F3N4O2S
Mol. Mass.:
428.472
SMILES:
CC(C)[C@@H]1CN(CCN1c1nccc(n1)C(F)(F)F)c1cccc(c1)S(C)(=O)=O
: