Target
Oxysterols receptor LXR-alpha
Ligand
BDBM304524
Substrate
Meas. Tech.
LXR alpha/beta Radioligand Binding Assay
Ki
67.0±n/a nM
Citation
 Claremon, DADong, CFan, YLeftheris, KLotesta, SDSingh, SBTice, CMZhao, WZheng, YZhuang, L Piperazine derivatives as liver X receptor modulators US Patent  US10144715 Publication Date 12/4/2018 
Target
Name:
Oxysterols receptor LXR-alpha
Synonyms:
LXRA Liver X receptor alpha Liver X receptor alpha (NR1H3) NR1H3 Nuclear orphan receptor LXR-alpha | Nuclear receptor subfamily 1 group H member 3
Type:
Enzyme Catalytic Domain
Mol. Mass.:
50403.85
Organism:
Homo sapiens (Human)
Description:
Q13133
Residue:
447
  
Inhibitor
Name:
BDBM304524
Synonyms:
1-(2-((R)-4-(4-fluoro-3-(methylsulfonyl)phenyl)-2-isopropylpiperazin-1-yl)-5-(trifluoromethyl)pyrimidin-4-yl)ethan-1-ol | US10144715, Compound 38-1
Type:
Small organic molecule
Emp. Form.:
C20H21F4N5O2S
Mol. Mass.:
471.472
SMILES:
CC(C)[C@@H]1CN(CCN1c1ncc(c(n1)C#N)C(F)(F)F)c1ccc(F)c(c1)S(C)(=O)=O
: