Target
Glycogen synthase kinase-3 alpha
Ligand
BDBM8295
Substrate
Biotinylated Peptide Substrate
Meas. Tech.
Kinase Inhibition SPA Assay
pH
7±n/a
Temperature
295.15±n/a K
IC50
>3000±n/a nM
Citation
 Coghlan, MPCulbert, AACross, DACorcoran, SLYates, JWPearce, NJRausch, OLMurphy, GJCarter, PSRoxbee Cox, LMills, DBrown, MJHaigh, DWard, RWSmith, DGMurray, KJReith, ADHolder, JC Selective small molecule inhibitors of glycogen synthase kinase-3 modulate glycogen metabolism and gene transcription. Chem Biol 7:793-803 (2000)  
Target
Name:
Glycogen synthase kinase-3 alpha
Synonyms:
GSK-3 alpha GSK3A_HUMAN Glycogen synthase kinase-3 Glycogen synthase kinase-3 alpha (GSK3 Alpha) Glycogen synthase kinase-3 alpha (GSK3alpha)
Type:
Enzyme
Mol. Mass.:
50991.79
Organism:
Homo sapiens (Human)
Description:
P49840
Residue:
483
  
Inhibitor
Name:
BDBM8295
Synonyms:
3-(4-chlorophenyl)-4-[(3,5-dichloro-4-hydroxyphenyl)amino]-1-methyl-2,5-dihydro-1H-pyrrole-2,5-dione | 4-arylmaleimide deriv. 9c
Type:
Small organic molecule
Emp. Form.:
C17H11Cl3N2O3
Mol. Mass.:
397.64
SMILES:
CN1C(=O)C(Nc2cc(Cl)c(O)c(Cl)c2)=C(C1=O)c1ccc(Cl)cc1
:
Substrate
Name:
Biotinylated Peptide Substrate
Synonyms:
Type:
Peptide
Mol. Mass.:
3615.87
Organism:
Description:
Residue:
32