Target
Mast/stem cell growth factor receptor Kit [V560G,D816V]
Ligand
BDBM175449
Substrate
Meas. Tech.
Autophosphorylation Assay
Temperature
298.15±n/a K
IC50
<10.00±n/a nM
Comments
extracted
Citation
 Hodous, BL Compositions useful for treating disorders related to kit US Patent  US9688680 Publication Date 6/27/2017 
Target
Name:
Mast/stem cell growth factor receptor Kit [V560G,D816V]
Synonyms:
KIT SCFR | Tyrosine-protein kinase Kit (Kit)(V560G/D816V)
Type:
Mol. Mass.:
109812.35
Organism:
Homo sapiens (Human)
Description:
Human Kit V560G/D816V mutant
Residue:
976
  
Inhibitor
Name:
BDBM175449
Synonyms:
US9688680, 49
Type:
Small organic molecule
Emp. Form.:
C24H25N7O
Mol. Mass.:
427.5016
SMILES:
Cc1ccc(CNC(=O)C2CN(C2)c2ncnn3cc(cc23)-c2cnn3CCCc23)cc1
: