Target
Mast/stem cell growth factor receptor Kit [V560G,D816V]
Ligand
BDBM175473
Substrate
Meas. Tech.
Autophosphorylation Assay
Temperature
298.15±n/a K
IC50
55±n/a nM
Comments
extracted
Citation
 Hodous, BL Compositions useful for treating disorders related to kit US Patent  US9688680 Publication Date 6/27/2017 
Target
Name:
Mast/stem cell growth factor receptor Kit [V560G,D816V]
Synonyms:
KIT SCFR | Tyrosine-protein kinase Kit (Kit)(V560G/D816V)
Type:
Mol. Mass.:
109812.35
Organism:
Homo sapiens (Human)
Description:
Human Kit V560G/D816V mutant
Residue:
976
  
Inhibitor
Name:
BDBM175473
Synonyms:
US9688680, 73 | US9688680, 99
Type:
Small organic molecule
Emp. Form.:
C23H24ClN7O
Mol. Mass.:
449.936
SMILES:
CC[C@H](NC(=O)C1CN(C1)c1ncnn2cc(cc12)-c1cnn(C)c1)c1ccc(Cl)cc1
: