Target
Mast/stem cell growth factor receptor Kit [V560G,D816V]
Ligand
BDBM175621
Substrate
Meas. Tech.
Autophosphorylation Assay
Temperature
298.15±n/a K
IC50
<10.00±n/a nM
Comments
extracted
Citation
 Hodous, BL Compositions useful for treating disorders related to kit US Patent  US9688680 Publication Date 6/27/2017 
Target
Name:
Mast/stem cell growth factor receptor Kit [V560G,D816V]
Synonyms:
KIT SCFR | Tyrosine-protein kinase Kit (Kit)(V560G/D816V)
Type:
Mol. Mass.:
109812.35
Organism:
Homo sapiens (Human)
Description:
Human Kit V560G/D816V mutant
Residue:
976
  
Inhibitor
Name:
BDBM175621
Synonyms:
US9688680, 170
Type:
Small organic molecule
Emp. Form.:
C28H31N5O2
Mol. Mass.:
469.578
SMILES:
C[C@H](NC(=O)C1CN(C1)c1ncnn2cc(cc12)-c1ccc(cc1)C(C)(C)O)c1ccc(C)cc1
: