Target
Beta-secretase 1
Ligand
BDBM116272
Substrate
Meas. Tech.
β-Secretase-Inhibiting Activity
IC50
514±n/a nM
Citation
 Hori, AYonezawa, SFujikoshi, CMatsumoto, SKooriyama, YUeno, TKato, T Sulfur-containing heterocyclic derivative having beta secretase inhibitory activity US Patent  US9650371 Publication Date 5/16/2017 
Target
Name:
Beta-secretase 1
Synonyms:
ASP2 Aspartyl protease 2 BACE1 Beta-secretase (BACE) Beta-secretase 1 (BACE 1) Beta-secretase 1 (BACE1) Beta-site amyloid precursor protein cleaving enzyme 1 Memapsin-2 beta-Secretase (BACE-1) | beta-Secretase (BACE1)
Type:
Protein
Mol. Mass.:
55755.10
Organism:
Homo sapiens (Human)
Description:
P56817
Residue:
501
  
Inhibitor
Name:
BDBM116272
Synonyms:
US8637504, 2 US9650371, 2
Type:
Small organic molecule
Emp. Form.:
C21H25N5O2S
Mol. Mass.:
411.521
SMILES:
COc1cnc(cn1)C(=O)Nc1cccc(c1)C1(CSC(N)=N1)C1CCCCC1
: