Target
Metabotropic glutamate receptor 1
Ligand
BDBM136031
Substrate
Meas. Tech.
Induced Intracellular Calcium Assay
IC50
5900±n/a nM
Citation
 Behnke, DCarcache, DErtl, PKoller, MOrain, D Diazepinone derivatives US Patent  US9650377 Publication Date 5/16/2017 
Target
Name:
Metabotropic glutamate receptor 1
Synonyms:
GPRC1A GRM1_HUMAN Metabotropic Glutamate 1a | metabotropic glutamate 1
Type:
Enzyme
Mol. Mass.:
132358.19
Organism:
Homo sapiens (Human)
Description:
Q13255
Residue:
1194
  
Inhibitor
Name:
BDBM136031
Synonyms:
US8853203, 86 | US9650377, Example 86
Type:
Small organic molecule
Emp. Form.:
C24H21FN4O
Mol. Mass.:
400.4481
SMILES:
CCc1cn(cn1)C1=NCC(=O)N2CCc3c(cccc3-c3ccc(F)cc3)C2=C1
: