Target
Metabotropic glutamate receptor 1
Ligand
BDBM136085
Substrate
Meas. Tech.
Induced Intracellular Calcium Assay
IC50
>10000±n/a nM
Citation
 Behnke, DCarcache, DErtl, PKoller, MOrain, D Diazepinone derivatives US Patent  US9650377 Publication Date 5/16/2017 
Target
Name:
Metabotropic glutamate receptor 1
Synonyms:
GPRC1A GRM1_HUMAN Metabotropic Glutamate 1a | metabotropic glutamate 1
Type:
Enzyme
Mol. Mass.:
132358.19
Organism:
Homo sapiens (Human)
Description:
Q13255
Residue:
1194
  
Inhibitor
Name:
BDBM136085
Synonyms:
US8853203, 108a | US9650377, Example 108a
Type:
Small organic molecule
Emp. Form.:
C22H20N6O2
Mol. Mass.:
400.4332
SMILES:
Cc1nc(co1)-c1cccc2C3=CC(=NCC(=O)N3CCc12)n1cnc(n1)C1CC1
: