Target
Tyrosine-protein kinase Mer
Ligand
BDBM308350
Substrate
Meas. Tech.
Activity Assay
IC50
1.000±n/a nM
Citation
 Wang, XZhang, WFrye, S Therapeutic uses of selected pyrimidine compounds with anti-Mer tyrosine kinase activity US Patent  US9649309 Publication Date 5/16/2017 
Target
Name:
Tyrosine-protein kinase Mer
Synonyms:
MER MERTK Proto-oncogene c-Mer Receptor tyrosine kinase MerTK | Tyrosine-protein kinase Mer
Type:
PROTEIN
Mol. Mass.:
110234.77
Organism:
Homo sapiens (Human)
Description:
ChEMBL_1498723
Residue:
999
  
Inhibitor
Name:
BDBM308350
Synonyms:
US9649309, Compound UNC4166A
Type:
Small organic molecule
Emp. Form.:
C30H44N6O
Mol. Mass.:
504.71
SMILES:
CCCCNc1ncc(c(N[C@H]2CC[C@H](O)CC2)n1)-c1ccc(CNC23CC4CC(CC(C4)C2)C3)cn1
: