Target
Tyrosine-protein kinase Mer
Ligand
BDBM308366
Substrate
IC50
1.10±n/a nM
Citation
 Wang, XZhang, WFrye, S Therapeutic uses of selected pyrimidine compounds with anti-Mer tyrosine kinase activity US Patent  US9649309 Publication Date 5/16/2017 
Target
Name:
Tyrosine-protein kinase Mer
Synonyms:
MER MERTK Proto-oncogene c-Mer Receptor tyrosine kinase MerTK | Tyrosine-protein kinase Mer
Type:
PROTEIN
Mol. Mass.:
110234.77
Organism:
Homo sapiens (Human)
Description:
ChEMBL_1498723
Residue:
999
  
Inhibitor
Name:
BDBM308366
Synonyms:
US9649309, Compound UNC4340A
Type:
Small organic molecule
Emp. Form.:
C28H42N6O
Mol. Mass.:
478.6727
SMILES:
CCCCNc1ncc(c(N[C@H]2CC[C@H](O)CC2)n1)-c1ccc(C=C2CCN(CC2)C(C)C)cn1
: