Target
Alpha-1,3-mannosyl-glycoprotein 2-beta-N-acetylglucosaminyltransferase
Ligand
BDBM309317
Substrate
Meas. Tech.
Radioligand Binding Assay
Ki
<10.00±n/a nM
Citation
 Amberg, WPohlki, FLange, UWang, YXZhao, HHLi, HBrewer, JTZanze, IDietrich, JVasudevan, ADjuric, SWLao, YHutchins, CW Pyrrolidine derivatives, pharmaceutical compositions containing them, and their use in therapy US Patent  US9656955 Publication Date 5/23/2017 
Target
Name:
Alpha-1,3-mannosyl-glycoprotein 2-beta-N-acetylglucosaminyltransferase
Synonyms:
GGNT1 GLYT1 GlcNAc-T I MGAT1 N-glycosyl-oligosaccharide-glycoprotein N-acetylglucosaminyltransferase I
Type:
PROTEIN
Mol. Mass.:
50891.32
Organism:
Homo sapiens (Human)
Description:
ChEMBL_107587
Residue:
445
  
Inhibitor
Name:
BDBM309317
Synonyms:
(3R,4S)-N-(3-chloro-4-fluorophenyl)-4-(4-fluorophenyl)-1-[(1-methyl-1H-1,2,3-triazol-4-yl)sulfonyl]pyrrolidin-3-amine | US9656955, Example 842
Type:
Small Organic Molecule
Emp. Form.:
C19H18ClF2N5O2S
Mol. Mass.:
453.893
SMILES:
Cn1cc(nn1)S(=O)(=O)N1C[C@H](Nc2ccc(F)c(Cl)c2)[C@H](C1)c1ccc(F)cc1
: