Target
Tumor necrosis factor
Ligand
BDBM309887
Substrate
Meas. Tech.
Enzymatic Inhibitory Assay
IC50
29.1±n/a nM
Citation
 Xu, ZLou, Y Fused heterocyclic compound, preparation method therefor, pharmaceutical composition, and uses thereof US Patent  US9656996 Publication Date 5/23/2017 
Target
Name:
Tumor necrosis factor
Synonyms:
Cachectin TNF-a TNFA TNFSF2 Tumor necrosis factor (TNFa) Tumor necrosis factor ligand superfamily member 2 Tumor necrosis factor, soluble form | tumor necrosis factor alpha
Type:
Enzyme
Mol. Mass.:
25645.11
Organism:
Homo sapiens (Human)
Description:
P01375
Residue:
233
  
Inhibitor
Name:
BDBM309887
Synonyms:
US9656996, Compound 1
Type:
Small organic molecule
Emp. Form.:
C28H38N6O5S
Mol. Mass.:
570.704
SMILES:
COc1ncc(cc1NS(C)(=O)=O)-c1nc(nc2c(CN3CCC(CC3)C(C)(C)O)cccc12)N1CCOCC1
: