Target
Cytochrome P450 11B2, mitochondrial
Ligand
BDBM8916
Substrate
BDBM8582
Meas. Tech.
CYP11B Assay
IC50
39±n/a nM
Citation
 Voets, MAntes, IScherer, CMuller-Vieira, UBiemel, KBarassin, CMarchais-Oberwinkler, SHartmann, RW Heteroaryl-substituted naphthalenes and structurally modified derivatives: selective inhibitors of CYP11B2 for the treatment of congestive heart failure and myocardial fibrosis. J Med Chem 48:6632-42 (2005)  
Target
Name:
Cytochrome P450 11B2, mitochondrial
Synonyms:
Aldosterone Synthase (CYP11B2) Aldosterone-synthesizing enzyme CYP11B2 Cytochrome P450 11B2 Cytochrome P450 11B2, mitochondrial P-450C18 | Steroid 18-hydroxylase
Type:
Protein
Mol. Mass.:
57582.15
Organism:
Homo sapiens (Human)
Description:
P19099
Residue:
503
  
Inhibitor
Name:
BDBM8916
Synonyms:
1-(2-Naphthyl)-1H-imidazole Imidazole-substituted naphthalene 23 | US9271963, 23
Type:
Small organic molecule
Emp. Form.:
C13H10N2
Mol. Mass.:
194.2319
SMILES:
c1cn(cn1)-c1ccc2ccccc2c1
:
Substrate
Name:
BDBM8582
Synonyms:
(1S,2R,10S,11S,14S,15S)-14-(2-hydroxyacetyl)-2,15-dimethyltetracyclo[8.7.0.0^{2,7}.0^{11,15}]heptadec-6-en-5-one 21-hydroxypregn-4-ene-3,20-dione [4-14C]-11-deoxycorticosterone | deoxycorticosterone
Type:
Small organic molecule
Emp. Form.:
C21H30O3
Mol. Mass.:
330.4611
SMILES:
[H][C@@]12CC[C@H](C(=O)CO)[C@@]1(C)CC[C@@]1([H])[C@@]2([H])CCC2=CC(=O)CC[C@]12C
: