Target
Mitogen-activated protein kinase kinase kinase 5
Ligand
BDBM307648
Substrate
Meas. Tech.
ASK1 Kinase Assay
Ki
<200±n/a nM
Citation
 Brown, SD ASK1 inhibitor compounds and uses thereof US Patent  US10150755 Publication Date 12/11/2018 
Target
Name:
Mitogen-activated protein kinase kinase kinase 5
Synonyms:
ASK1 MAP3K5 MEKK5
Type:
Protein
Mol. Mass.:
154514.93
Organism:
Homo sapiens (Human)
Description:
Q99683
Residue:
1374
  
Inhibitor
Name:
BDBM307648
Synonyms:
2-(6-(4-cyclopropyl- 4H-1,2,4-triazol-3- yl)pyridin-2-yl)-6- (pyridin-3- yl)isoindolin-1-one | US10150755, Compound 40
Type:
Small organic molecule
Emp. Form.:
C23H18N6O
Mol. Mass.:
394.4286
SMILES:
O=C1N(Cc2ccc(cc12)-c1cccnc1)c1cccc(n1)-c1nncn1C1CC1
: