Target
Apelin receptor
Ligand
BDBM310359
Substrate
Meas. Tech.
[35S]GTPgammaS Binding
EC50
710±n/a nM
Citation
 Chen, XCheng, ACConnors, RVDebenedetto, MVDransfield, PJFu, ZHarvey, JSHeath, JAHouze, JJudd, TCKopecky, DJLai, SMa, ZNishimura, NOlson, SHPattaropong, VWang, X Compounds for use in preparing heterocyclic triazole agonists of the APJ receptor US Patent  US10150760 Publication Date 12/11/2018 
Target
Name:
Apelin receptor
Synonyms:
AGTRL1 APJ_HUMAN Angiotensin receptor-like 1 Apelin receptor (APJ) G-protein coupled receptor HG11
Type:
Enzyme Catalytic Domain
Mol. Mass.:
42664.06
Organism:
Homo sapiens (Human)
Description:
P35414
Residue:
380
  
Inhibitor
Name:
BDBM310359
Synonyms:
(3R,5S)—N-(4-(4,6-dimethoxy-5-pyrimidinyl)-5-((2R)-1,4-dioxan-2-yl)-4H-1,2,4-triazol-3-yl)-1-(5-fluoro-2-pyrimidinyl)-5-(1-methylethoxy)-3-piperidinesulfonamide or (3R,5S)—N-(4-(4,6-dimethoxy-5-pyrimidinyl)-5-((2S)-1,4-dioxan-2-yl)-4H-1,2,4-triazol-3-yl)-1-(5-fluoro-2-pyrimidinyl)-5-(1-methylethoxy)-3-piperidinesulfonamide US10150760, Example 180.0
Type:
Small organic molecule
Emp. Form.:
C24H32FN9O7S
Mol. Mass.:
609.63
SMILES:
COc1ncnc(OC)c1-n1c(NS(=O)(=O)[C@@H]2C[C@@H](CN(C2)c2ncc(F)cn2)OC(C)C)nnc1[C@@H]1COCCO1
: