Target
Sodium/glucose cotransporter 2
Ligand
BDBM176529
Substrate
Meas. Tech.
In Vitro Human SGLT2 Inhibition Assay
pH
7.3±n/a
IC50
<10.00±n/a nM
Comments
extracted
Citation
 Carson, KGGoodwin, NCHarrison, BARawlins, DBStrobel, EZambrowicz, B Inhibitors of sodium glucose cotransporter 1 US Patent  US9688710 Publication Date 6/27/2017 
Target
Name:
Sodium/glucose cotransporter 2
Synonyms:
Na(+)/glucose cotransporter 2 SGLT2 Sodium-Dependent Glucose Cotransporter 2 (SGLT2) Solute carrier family 5 member 2
Type:
Protein
Mol. Mass.:
72902.00
Organism:
Homo sapiens (Human)
Description:
P31639
Residue:
672
  
Inhibitor
Name:
BDBM176529
Synonyms:
US9688710, 92 (2S,3R,4R,5S,6R)-2-(3-(4-(4-aminobutyl)benzyl)-4-methylphenyl)-6-(methylthio)tetrahydro-2H-pyran-3,4,5-triol
Type:
Small organic molecule
Emp. Form.:
C24H33NO4S
Mol. Mass.:
431.588
SMILES:
CS[C@H]1O[C@H]([C@H](O)[C@@H](O)[C@@H]1O)c1ccc(C)c(Cc2ccc(CCCCN)cc2)c1
: