Target
AP2-associated protein kinase 1
Ligand
BDBM311232
Substrate
Meas. Tech.
AAK1 Kinase Assay
IC50
0.460±n/a nM
Citation
 Luo, GDzierba, CDMacor, JE Biaryl kinase inhibitors US Patent  US10155760 Publication Date 12/18/2018 
Target
Name:
AP2-associated protein kinase 1
Synonyms:
AAK1 Adaptor-associated kinase 1 | KIAA1048
Type:
PROTEIN
Mol. Mass.:
103884.23
Organism:
Homo sapiens (Human)
Description:
ChEMBL_774569
Residue:
961
  
Inhibitor
Name:
BDBM311232
Synonyms:
(S)-1-(4-(7-chloroquinolin-4-yl)-2-(trifluoromethyl)phenoxy)-2,4-dimethylpentan-2-amine US10351563, Example 88 US10723734, Example 88 US9902722, Example 88
Type:
Small organic molecule
Emp. Form.:
C23H24ClF3N2O
Mol. Mass.:
436.898
SMILES:
CC(C)C[C@](C)(N)COc1ccc(cc1C(F)(F)F)-c1ccnc2cc(Cl)ccc12
: