Target
AP2-associated protein kinase 1
Ligand
BDBM311249
Substrate
Meas. Tech.
AAK1 Kinase Assay
IC50
0.720±n/a nM
Citation
 Luo, GDzierba, CDMacor, JE Biaryl kinase inhibitors US Patent  US10155760 Publication Date 12/18/2018 
Target
Name:
AP2-associated protein kinase 1
Synonyms:
AAK1 Adaptor-associated kinase 1 | KIAA1048
Type:
PROTEIN
Mol. Mass.:
103884.23
Organism:
Homo sapiens (Human)
Description:
ChEMBL_774569
Residue:
961
  
Inhibitor
Name:
BDBM311249
Synonyms:
(S)-2-((2-amino-2,4-dimethylpentyl)oxy)-5-(5-fluoro-2-methylpyridin-4-yl)benzonitrile US10351563, Example 105 US10723734, Example 105 US9902722, Example 105
Type:
Small organic molecule
Emp. Form.:
C20H24FN3O
Mol. Mass.:
341.4225
SMILES:
CC(C)C[C@](C)(N)COc1ccc(cc1C#N)-c1cc(C)ncc1F
: