Target
AP2-associated protein kinase 1
Ligand
BDBM311266
Substrate
Meas. Tech.
AAK1 Kinase Assay
IC50
0.510±n/a nM
Citation
 Luo, GDzierba, CDMacor, JE Biaryl kinase inhibitors US Patent  US10155760 Publication Date 12/18/2018 
Target
Name:
AP2-associated protein kinase 1
Synonyms:
AAK1 Adaptor-associated kinase 1 | KIAA1048
Type:
PROTEIN
Mol. Mass.:
103884.23
Organism:
Homo sapiens (Human)
Description:
ChEMBL_774569
Residue:
961
  
Inhibitor
Name:
BDBM311266
Synonyms:
(S)-1-((4-(difluoromethyl)-2′-methyl-[2,4′-bipyridin]-5-yl)oxy)-2,4-dimethylpentan-2-amine US10351563, Example 122 US10723734, Example 122 US9902722, Example 122
Type:
Small organic molecule
Emp. Form.:
C19H25F2N3O
Mol. Mass.:
349.4181
SMILES:
CC(C)C[C@](C)(N)COc1cnc(cc1C(F)F)-c1ccnc(C)c1
: