Target
AP2-associated protein kinase 1
Ligand
BDBM311374
Substrate
Meas. Tech.
AAK1 Kinase Assay
IC50
0.470±n/a nM
Citation
 Luo, GDzierba, CDMacor, JE Biaryl kinase inhibitors US Patent  US10155760 Publication Date 12/18/2018 
Target
Name:
AP2-associated protein kinase 1
Synonyms:
AAK1 Adaptor-associated kinase 1 | KIAA1048
Type:
PROTEIN
Mol. Mass.:
103884.23
Organism:
Homo sapiens (Human)
Description:
ChEMBL_774569
Residue:
961
  
Inhibitor
Name:
BDBM311374
Synonyms:
(S)-1-((6-(7-chloroquinolin-4-yl)-4-methylpyridin-3-yl)oxy)-2,4-dimethylpentan-2-amine US10155760, Example 231 | US9902722, Example 231
Type:
Small organic molecule
Emp. Form.:
C22H26ClN3O
Mol. Mass.:
383.914
SMILES:
CC(C)C[C@](C)(N)COc1cnc(cc1C)-c1ccnc2cc(Cl)ccc12
: