Target
AP2-associated protein kinase 1
Ligand
BDBM311378
Substrate
Meas. Tech.
AAK1 Kinase Assay
IC50
0.360±n/a nM
Citation
 Luo, GDzierba, CDMacor, JE Biaryl kinase inhibitors US Patent  US10155760 Publication Date 12/18/2018 
Target
Name:
AP2-associated protein kinase 1
Synonyms:
AAK1 Adaptor-associated kinase 1 | KIAA1048
Type:
PROTEIN
Mol. Mass.:
103884.23
Organism:
Homo sapiens (Human)
Description:
ChEMBL_774569
Residue:
961
  
Inhibitor
Name:
BDBM311378
Synonyms:
(S)-1-((4-chloro-6-(6-fluoroquinolin-4-yl)pyridin-3-yl)oxy)-2,4-dimethylpentan-2-amine US10155760, Example 235 US9902722, Example 235
Type:
Small organic molecule
Emp. Form.:
C21H23ClFN3O
Mol. Mass.:
387.878
SMILES:
CC(C)C[C@](C)(N)COc1cnc(cc1Cl)-c1ccnc2ccc(F)cc12
: