Target
Voltage-dependent calcium channel gamma-2 subunit
Ligand
BDBM311785
Substrate
Meas. Tech.
Calcium Flux Assay
IC50
0.398±n/a nM
Citation
 Ameriks, MKLaforteza, BNLebold, TPRavula, SSavall, BMShireman, BT Fused azaheterocyclic compounds and their use as AMPA receptor modulators US Patent  US10155769 Publication Date 12/18/2018 
Target
Name:
Voltage-dependent calcium channel gamma-2 subunit
Synonyms:
CACNG2 Neuronal voltage-gated calcium channel gamma-2 subunit Transmembrane AMPAR regulatory protein gamma-2
Type:
Enzyme Catalytic Domain
Mol. Mass.:
35977.54
Organism:
Homo sapiens (Human)
Description:
Residue:
323
  
Inhibitor
Name:
BDBM311785
Synonyms:
8-(7-Chloro-1H-indazol-5-yl)-7-(difluoromethyl)-2-(trifluoromethyl)-[1,2,4]triazolo[1,5-a]pyridine | US10155769, Example 23
Type:
Small organic molecule
Emp. Form.:
C15H7ClF5N5
Mol. Mass.:
387.695
SMILES:
FC(F)c1ccn2nc(nc2c1-c1cc(Cl)c2[nH]ncc2c1)C(F)(F)F
: