Target
Phosphatidylinositol 3-kinase regulatory subunit alpha/4,5-bisphosphate 3-kinase catalytic subunit beta isoform
Ligand
BDBM179450
Substrate
Meas. Tech.
PI3-Kinase HTRF Assay
IC50
<10.00±n/a nM
Citation
 Scott, WJPetrov, OMöwes, MLiu, NBömer, U Arylaminoalcohol-substituted 2,3-dihydroimidazo[1,2-C]quinolines US Patent  US9675616 Publication Date 6/13/2017 
Target
Name:
Phosphatidylinositol 3-kinase regulatory subunit alpha/4,5-bisphosphate 3-kinase catalytic subunit beta isoform
Synonyms:
PI3-kinase subunit p110 beta/p85 alpha PI3K p110beta/p85alpha (Human) p110β/p85α | p110beta/p85alpha
Type:
Protein
Mol. Mass.:
Description:
Components:
This complex has 2 components.
Component 1
Name:
Phosphatidylinositol 4,5-bisphosphate 3-kinase catalytic subunit beta isoform
Synonyms:
PI3-kinase p110 subunit beta PI3Kbeta PIK3CB Phosphatidylinositol 4,5-bisphosphate 3-kinase catalytic subunit beta (PI3Kbeta) Phosphatidylinositol 4,5-bisphosphate 3-kinase catalytic subunit beta isoform (PI3K) Phosphatidylinositol 4,5-bisphosphate 3-kinase catalytic subunit beta isoform (PI3Kbeta) Phosphatidylinositol-4,5-bisphosphate 3-kinase catalytic subunit beta isoform Phosphoinositide 3-Kinase (PI3K), beta Chain A PtdIns-3-kinase p110
Type:
Enzyme Subunit
Mol. Mass.:
122769.00
Organism:
Homo sapiens (Human)
Description:
P42338
Residue:
1070
  
Component 2
Name:
Phosphatidylinositol 3-kinase regulatory subunit alpha
Synonyms:
GRB1 PI3-kinase class I PI3-kinase p85-alpha subunit PI3-kinase subunit p85-alpha PIK3CG/PIK3R1 Phosphatidylinositol 3-kinase 85 kDa regulatory subunit alpha (PI3K alpha) Phosphatidylinositol 3-kinase regulatory subunit alpha (PIK3R1) Phosphatidylinositol 3-kinase regulatory subunit alpha isoform 1 (PI3 Kinase alpha) Phosphatidylinositol 4,5-bisphosphate 3-kinase catalytic subunit alpha isoform (PI3Kalpha) PtdIns-3-kinase p85-alpha p85 alpha
Type:
Protein
Mol. Mass.:
83592.82
Organism:
Homo sapiens (Human)
Description:
P27986
Residue:
724
  
Inhibitor
Name:
BDBM179450
Synonyms:
US9675616, 7 2-Amino-N-(8-{[(2R)-2-hydroxy-3-{[(1S)-1-phenylethyl]amino}propyl]oxy}-7-methoxy-2,3-dihydroimidazo[1,2-c]quinazolin-5-yl)pyrimidine-5-carboxamide
Type:
Small organic molecule
Emp. Form.:
C27H30N8O4
Mol. Mass.:
530.5783
SMILES:
COc1c(OC[C@H](O)CN[C@@H](C)c2ccccc2)ccc2C3=NCCN3C(NC(=O)c3cnc(N)nc3)=Nc12
: