Target
Caspase-3
Ligand
BDBM36363
Substrate
Meas. Tech.
procaspase-3 activation
EC50
220±n/a nM
Citation
 Hergenrother, PJPutt, KSPeterson, QPFako, V Compounds and methods for the treatment of cancer US Patent  US10166229 Publication Date 1/1/2019 
Target
Name:
Caspase-3
Synonyms:
Apopain CASP3 CPP-32 Caspase 3 Caspase-3 subunit p17 SCA-1 Yama protein | caspase-3 preproprotein
Type:
Hydrolase; heterotetramer of two heterodimers
Mol. Mass.:
31607.55
Organism:
Homo sapiens (Human)
Description:
Residue:
277
  
Inhibitor
Name:
BDBM36363
Synonyms:
CID6851947 US10166229, Example PAC-1
Type:
Small organic molecule
Emp. Form.:
C23H28N4O2
Mol. Mass.:
392.494
SMILES:
Oc1c(CC=C)cccc1\C=N\NC(=O)CN1CCN(Cc2ccccc2)CC1
: