Target
Membrane primary amine oxidase
Ligand
BDBM309474
Substrate
Meas. Tech.
Inhibitory Assay
IC50
1.000±n/a nM
Citation
 Matsukawa, TMasuzaki, KKawasaki, AAkasaka, AKawai, Y Benzene or thiophene derivative and use thereof as VAP-1 inhibitor US Patent  US9603833 Publication Date 3/28/2017 
Target
Name:
Membrane primary amine oxidase
Synonyms:
AOC3_RAT Aoc3 Vascular adhesion protein 1 (VAP-1)
Type:
Enzyme
Mol. Mass.:
84979.78
Organism:
Rattus norvegicus (Rat)
Description:
O08590
Residue:
763
  
Inhibitor
Name:
BDBM309474
Synonyms:
US9603833, Example 86
Type:
Small organic molecule
Emp. Form.:
C19H25N5O
Mol. Mass.:
339.4347
SMILES:
NNC(=O)Cc1ccc(CCc2ccc(cn2)N2CCNCC2)cc1
: