Target
Sigma intracellular receptor 2
Ligand
BDBM50374597
Substrate
Meas. Tech.
Receptor Assay
Ki
1.83±0.17 nM
Citation
 McCurdy, CRMesangeau, CChin, FTJames, MLShen, BGambhir, S Highly selective sigma receptor radioligands US Patent  US9604926 Publication Date 3/28/2017 
Target
Name:
Sigma intracellular receptor 2
Synonyms:
S2r Sigma-2 receptor Tmem97 | Transmembrane protein 97
Type:
Mol. Mass.:
20818.69
Organism:
Mus musculus (Mouse)
Description:
Q8VD00
Residue:
176
  
Inhibitor
Name:
BDBM50374597
Synonyms:
CHEMBL271772 US9724435, Compound CM-121
Type:
Small organic molecule
Emp. Form.:
C21H31N3O2
Mol. Mass.:
357.4897
SMILES:
O=c1oc2ccccc2n1CCCCN1CCN(CC1)C1CCCCC1
: