Target
Sigma non-opioid intracellular receptor 1
Ligand
BDBM50374603
Substrate
Meas. Tech.
Receptor Assay
Ki
4.60±1.08 nM
Citation
 McCurdy, CRMesangeau, CChin, FTJames, MLShen, BGambhir, S Highly selective sigma receptor radioligands US Patent  US9604926 Publication Date 3/28/2017 
Target
Name:
Sigma non-opioid intracellular receptor 1
Synonyms:
Opioid receptor, sigma 1 SGMR1_MOUSE Sigma1-receptor Sigmar1
Type:
Enzyme Catalytic Domain
Mol. Mass.:
25246.51
Organism:
Mus musculus (Mouse)
Description:
O55242
Residue:
223
  
Inhibitor
Name:
BDBM50374603
Synonyms:
CHEMBL272610 US9724435, Compound SN-48
Type:
Small organic molecule
Emp. Form.:
C23H35N3O2
Mol. Mass.:
385.5429
SMILES:
O=c1oc2ccccc2n1CCCCCCN1CCN(CC1)C1CCCCC1
: